{"text_format":"1","workbook":"xlsx","n_sheets":5,"sheets":["Ficha socio-económica","Datos","Cálculo","Formato expediente","Tabla"],"not_rendered":{"charts":0,"images":0,"macros":1,"external_links":0,"defined_names":7,"comments":0,"pivot_tables":0},"unopened":[],"bounds":{"document_bytes":16777216,"sheet_cells":100000,"rows_first":2000,"rows_last":500,"rows_between":2000,"halvings":0,"cell_chars":16384,"cell_head_chars":4096},"cells_cut":0,"cells_raw":0,"read":"whole","date_system":"1900"}

{"sheet":"Ficha socio-económica","index":0,"n_rows":279,"n_cols":11,"rows_kept":279,"cut":false,"hidden":false,"merged":[[1,0,1,8],[3,0,3,8],[30,0,30,5],[20,3,20,8],[11,0,11,1],[18,5,18,8],[16,6,16,8],[27,0,27,1],[13,0,13,1],[10,3,10,8],[2,0,2,7],[10,0,10,2],[20,0,20,2],[15,4,15,8],[11,6,11,8],[12,1,12,8],[36,0,36,8],[35,5,35,8],[26,2,26,3],[26,4,26,8],[31,4,31,8],[27,6,27,8],[35,0,35,4],[28,4,28,8],[32,4,32,5],[33,4,33,8],[32,6,32,8],[30,6,30,8],[32,2,32,3],[23,5,23,8],[6,1,6,2],[16,1,16,2],[22,0,22,1],[15,0,15,3],[23,2,23,4],[7,1,7,4],[8,2,8,4],[7,7,7,8],[4,7,4,8],[5,6,5,8],[32,0,32,1],[31,2,31,3],[25,0,25,5],[25,6,25,8],[27,2,27,3],[9,0,9,2],[22,7,22,8],[9,3,9,8],[13,5,13,8],[22,2,22,3],[17,1,17,8],[8,0,8,1],[27,4,27,5],[6,7,6,8],[4,4,4,5],[4,0,4,1],[4,2,4,3],[5,0,5,1],[5,2,5,5]]}
[]
["FICHA SOCIO-ECONÓMICA"]
["Por favor señor estudiante llene la ficha con todos los casilleros correspondiente a datos personales aunque se auto-eduque y una vez terminada guárdela en el formato EXCEL y el formato PDF, y envíe los dos archivos al correo becasordinarias@uandina.edu.pe al igual que los otros documentos solicitados."]
["CATEGORIA: DATOS PERSONALES"]
["APELLIDO PATERNO:",null,"COMPLETAR",null,"APELLIDO PATERNO:",null,"COMPLETAR",null,null,null,{"$f":"C5&\" \"&G5&\", \"&C6","v":"COMPLETAR COMPLETAR, COMPLETAR"}]
["NOMBRES:",null,"COMPLETAR"]
["CÓDIGO:                                                                      ","COMPLETAR",null,"DNI:","COMPLETAR","EDAD:","COMPLETAR"]
["FACULTAD:",null,null,null,null,"CICLO:","COMPLETAR",{"$f":"VLOOKUP(B8,Datos!A2:B7,2,FALSE)","v":{"$error":"#N/A"}}]
["ESCUELA PROFESIONAL:",null,null,null,null,"SEMESTRE:","COMPLETAR","SEDE/FILIAL:"]
["LUGAR Y FECHA DE NACIMIENTO:",null,null,"COMPLETAR"]
["DIRECCIÓN EN LA CIUDAD DEL CUSCO:",null,null,"COMPLETAR"]
["DISTRITO:",null,"COMPLETAR","PROVINCIA:","COMPLETAR","DEPARTAMENTO:","COMPLETAR"]
["REFERENCIA:","COMPLETAR"]
["TELÉFONO FIJO:",null,"COMPLETAR","CELULAR:","COMPLETAR"]
[]
["DIRECCIÓN EN LUGAR DE ORIGEN (SOLO SI ES DE OTRO LUGAR):",null,null,null,"COMPLETAR"]
["DISTRITO:","COMPLETAR",null,"PROVINCIA:","COMPLETAR","DEPARTAMENTO:","COMPLETAR"]
["REFERENCIA:","COMPLETAR"]
["TELÉFONO FIJO:",null,"COMPLETAR","CELULAR:","COMPLETAR"]
[]
["SI SE AUTOEDUCA ESPECIFIQUE SU ACTIVIDAD:     ",null,null,"COMPLETAR"]
[]
["TIPO DE SEGURO QUE POSEE:                                                          ",null,"COMPLETAR",null,"CÓDIGO DE PAGO","COMPLETAR","FECHA DE PAGO","COMPLETAR"]
["NOMBRE DE LA ASEGURADORA:",null,"COMPLETAR"]
[]
["NOMBRE DEL PADRE DE FAMILIA Y/O TUTOR LEGAL RESPONSABLE ECONÓMICO DE SU EDUCACIÓN:   ",null,null,null,null,null,"COMPLETAR"]
["DNI:","COMPLETAR","DIRECCIÓN COMPLETA:",null,"COMPLETAR"]
["CENTRO DE TRABAJO:",null,"COMPLETAR",null,"ACTIVIDAD A LA QUE SE DEDICA:",null,"COMPLETAR"]
["CELULAR:","COMPLETAR","TELEFONO:","COMPLETAR"]
[]
["NOMBRE DE LA MADRE DE FAMILIA Y/O TUTOR LEGAL RESPONSABLE ECONÓMICO DE SU EDUCACIÓN:   ",null,null,null,null,null,"COMPLETAR"]
["DNI:","COMPLETAR","DIRECCIÓN COMPLETA:",null,"COMPLETAR"]
["CENTRO DE TRABAJO:",null,"COMPLETAR",null,"ACTIVIDAD A LA QUE SE DEDICA:",null,"COMPLETAR"]
["CELULAR:","COMPLETAR","TELEFONO:","COMPLETAR"]
[]
["ESPECIFICAR LA ACTIVIDAD LABORAL DEL RESPONSABLE ECONOMICO DE SU EDUCACIÓN: \n",null,null,null,null,"COMPLETAR"]
["COMPLETAR"]
[]
["El estudiante debe marcar una sóla alternativa con un aspa (X), caso contrario no será considerado válido."]
[]
{"$rows_left_out":240}
{"sheet":"Datos","index":1,"n_rows":16,"n_cols":7,"rows_kept":16,"cut":false,"hidden":true,"merged":[]}
[]
["FACULTAD","FACU","Facultad1","Facultad2","Facultad3","Facultad4","Facultad5"]
["FACULTAD DE CIENCIAS ECONÓMICAS ADMINISTRATIVAS Y CONTABLES","Facultad1","ADMINISTRACIÓN","EDUCACIÓN","ENFERMERÍA","DERECHO","ARQUITECTURA"]
["FACULTAD DE CIENCIAS Y HUMANIDADES","Facultad2","CONTABILIDAD","TURISMO","ESTOMATOLOGÍA",null,"INGENIERÍA AMBIENTAL"]
["FACULTAD DE CIENCIAS DE LA SALUD","Facultad3","ECONOMÍA",null,"MEDICINA HUMANA",null,"INGENIERÍA CIVIL"]
["FACULTAD DE DERECHO Y CIENCIA POLÍTICA","Facultad4","FINANZAS",null,"OBSTETRICIA",null,"INGENIERÍA DE SISTEMAS"]
["FACULTAD DE INGENIERÍA Y ARQUITECTURA","Facultad5","MARKETING",null,"PSICOLOGÍA",null,"INGENIERÍA INDUSTRIAL"]
[null,null,"ADMINISTRACIÓN DE NEGOCIOS INTERNACIONALES",null,"TECNOLOGÍA MÉDICA"]
[]
[]
["SEDE"]
["CUSCO – SEDE PRINCIPAL."]
["FILIAL SICUANI.",null,"facultad","FACULTAD DE CIENCIAS DE LA SALUD",{"$f":"VLOOKUP(D13,A3:B7,2,FALSE)","v":"Facultad3"},"MEDICINA HUMANA"]
["FILIAL QUILLABAMBA.",null,"escuela","INGENIERÍA AMBIENTAL"]
["FILIAL PUERTO MALDONADO."]
["FILIAL QOLLANA",null,"Facultad"]

{"sheet":"Cálculo","index":2,"n_rows":241,"n_cols":16,"rows_kept":241,"cut":false,"hidden":true,"merged":[[27,4,27,7],[28,4,28,5],[27,3,42,3],[49,4,49,5],[43,3,43,5],[48,5,48,6],[46,5,46,6],[47,5,47,6],[40,4,40,5],[41,4,41,5],[34,4,34,5],[35,4,35,5],[42,4,42,5],[36,4,36,5],[45,5,45,7],[39,4,39,7],[37,4,37,5],[38,4,38,5],[31,9,31,13],[29,4,29,5],[31,4,31,5],[32,4,32,5],[30,4,30,5],[32,9,32,17],[30,9,30,17],[31,14,31,17],[33,4,33,7],[0,4,0,10],[2,9,2,17],[19,12,19,17],[18,9,18,10],[13,9,13,10],[16,12,16,17],[12,6,12,7],[18,6,18,7],[19,6,19,7],[2,5,3,5],[15,5,15,6],[16,5,16,6],[3,11,3,17],[4,9,4,10],[5,14,5,17],[8,12,8,17],[29,12,29,13],[29,14,29,17],[23,11,23,12],[23,13,23,14],[25,9,25,17],[23,9,23,10],[23,15,23,17],[26,9,26,13],[27,12,27,16],[26,14,26,17],[28,13,28,14],[6,10,6,11],[7,12,7,17],[13,15,13,17],[10,11,10,15],[20,9,20,17],[16,9,16,11],[17,9,17,17],[18,12,18,17],[28,15,28,17],[28,9,28,10],[28,11,28,12],[9,9,9,10],[9,15,9,16],[22,12,22,17],[21,9,21,13],[21,14,21,17],[24,12,24,13],[24,14,24,17],[14,5,14,6],[14,11,14,17],[15,14,15,17],[11,9,11,17],[12,12,12,17]]}
[null,null,null,null,"CÁLCULO DE LA PUNTUACIÓN"]
[]
[{"$f":"'Ficha socio-económica'!A41","v":"CATEGORÍA: VIVIENDA"},{"$f":"SUM(B5:B51)","v":0},null,null,"RESUMEN","PUNTUACIÓN ACUMULADA",null,null,null,"DATOS DEL SOLICITANTE"]
[{"$f":"'Ficha socio-económica'!G42","v":"ALTERNATIVA"},null,null,null,"CATEGORIA",null,null,null,null,"NOMBRES COMPLETOS:",null,{"$f":"+'Ficha socio-económica'!C5","v":"COMPLETAR"}]
[{"$f":"'Ficha socio-económica'!G43","v":"ALOJADO"},{"$f":"IF('Ficha socio-económica'!I43=\"X\",'Ficha socio-económica'!J43,0)","v":0},null,null,{"$f":"A3","v":"CATEGORÍA: VIVIENDA"},{"$f":"B3","v":0},null,null,null,"CÓDIGO:                                                                      ",null,{"$f":"+'Ficha socio-económica'!B7","v":"COMPLETAR"},{"$f":"+'Ficha socio-económica'!D7","v":"DNI:"},{"$f":"+'Ficha socio-económica'!E7","v":"COMPLETAR"},{"$f":"+'Ficha socio-económica'!F7","v":"EDAD:"},{"$f":"+'Ficha socio-económica'!G7","v":"COMPLETAR"}]
[{"$f":"'Ficha socio-económica'!G44","v":"FAMILIAR"},{"$f":"IF('Ficha socio-económica'!I44=\"X\",'Ficha socio-económica'!J44,0)","v":0},null,null,{"$f":"A52","v":"CATEGORIA: SERVICIOS"},{"$f":"B52","v":0},null,null,null,"ESCUELA PROFESIONAL:",null,{"$f":"+'Ficha socio-económica'!C9","v":0},{"$f":"+'Ficha socio-económica'!F8","v":"CICLO:"},{"$f":"+'Ficha socio-económica'!G8","v":"COMPLETAR"}]
[{"$f":"'Ficha socio-económica'!G45","v":"ALQUILADA"},{"$f":"IF('Ficha socio-económica'!I45=\"X\",'Ficha socio-económica'!J45,0)","v":0},null,null,{"$f":"A81","v":"CATEGORIA: OTRAS COMODIDADES"},{"$f":"B81","v":0},null,null,null,"FACULTAD:",{"$f":"+'Ficha socio-económica'!B8","v":0},null,{"$f":"+'Ficha socio-económica'!F9","v":"SEMESTRE:"},{"$f":"+'Ficha socio-económica'!G9","v":"COMPLETAR"},{"$f":"+'Ficha socio-económica'!H9","v":"SEDE/FILIAL:"},{"$f":"+'Ficha socio-económica'!I9","v":0}]
[{"$f":"'Ficha socio-económica'!G46","v":"CONGREGACION"},{"$f":"IF('Ficha socio-económica'!I46=\"X\",'Ficha socio-económica'!J46,0)","v":0},null,null,{"$f":"A102","v":"CATEGORIA: FAMILIA Y ESTADO CIVIL"},{"$f":"B102","v":0},null,null,null,"LUGAR Y FECHA DE NACIMIENTO:",null,{"$f":"+'Ficha socio-económica'!D10","v":"COMPLETAR"}]
[{"$f":"'Ficha socio-económica'!G47","v":"PROPIA"},{"$f":"IF('Ficha socio-económica'!I47=\"X\",'Ficha socio-económica'!J47,0)","v":0},null,null,{"$f":"A122","v":"CATEGORIA: SALUD"},{"$f":"B122","v":0},null,null,null,"DIRECCIÓN EN LA CIUDAD DEL CUSCO:",null,null,{"$f":"+'Ficha socio-económica'!D11","v":"COMPLETAR"}]
[{"$f":"'Ficha socio-económica'!G48","v":"SEMICONSTRUIDA"},{"$f":"IF('Ficha socio-económica'!I48=\"X\",'Ficha socio-económica'!J48,0)","v":0},null,null,{"$f":"A134","v":"CATEGORIA: EDUCACIÓN"},{"$f":"B134","v":0},null,null,null,"DISTRITO:",null,{"$f":"+'Ficha socio-económica'!C12","v":"COMPLETAR"},{"$f":"+'Ficha socio-económica'!D12","v":"PROVINCIA:"},{"$f":"+'Ficha socio-económica'!E12","v":"COMPLETAR"},{"$f":"+'Ficha socio-económica'!F12","v":"DEPARTAMENTO:"},{"$f":"+'Ficha socio-económica'!G12","v":"COMPLETAR"}]
[{"$f":"'Ficha socio-económica'!G49","v":"CONSTRUIDA 1 PISO"},{"$f":"IF('Ficha socio-económica'!I49=\"X\",'Ficha socio-económica'!J49,0)","v":0},null,null,{"$f":"A153","v":"CATEGORIA ECONÓMICA: INGRESOS"},{"$f":"B153","v":0},null,null,null,"REFERENCIA:",null,{"$f":"+'Ficha socio-económica'!B14","v":0}]
[{"$f":"'Ficha socio-económica'!G50","v":"CONSTRUIDA 2 PISO"},{"$f":"IF('Ficha socio-económica'!I50=\"X\",'Ficha socio-económica'!J50,0)","v":0},null,null,{"$f":"A193","v":"CATEGORIA ECONÓMICA: EGRESOS"},{"$f":"B193","v":0}]
[{"$f":"'Ficha socio-económica'!G51","v":"CONSTRUIDA 3 PISO"},{"$f":"IF('Ficha socio-económica'!I51=\"X\",'Ficha socio-económica'!J51,0)","v":0},null,null,"PUNTUACIÓN TOTAL",{"$f":"SUM(F5:F12)","v":0},{"$f":"IF(F13<50,\"NO CALIFICA PARA BECA\",\"\")","v":"NO CALIFICA PARA BECA"},null,null,"DIRECCIÓN EN LUGAR DE ORIGEN (SOLO SI ES DE OTRO LUGAR)"]
[{"$f":"'Ficha socio-económica'!G52","v":"CONSTRUIDA MAS DE 3 PISO"},{"$f":"IF('Ficha socio-económica'!I52=\"X\",'Ficha socio-económica'!J52,0)","v":0},null,null,null,null,null,null,null,"DISTRITO:",null,{"$f":"+'Ficha socio-económica'!B17","v":"COMPLETAR"},{"$f":"+'Ficha socio-económica'!D17","v":"PROVINCIA:"},{"$f":"+'Ficha socio-económica'!E17","v":"COMPLETAR"},{"$f":"+'Ficha socio-económica'!F17","v":"DEPARTAMENTO:"},{"$f":"+'Ficha socio-económica'!G17","v":"COMPLETAR"}]
[{"$f":"'Ficha socio-económica'!G53","v":"COMUNIDAD CAMPESINA"},{"$f":"IF('Ficha socio-económica'!I53=\"X\",'Ficha socio-económica'!J53,0)","v":0},null,null,"CÓDIGO:",{"$f":"'Ficha socio-económica'!B7","v":"COMPLETAR"},null,null,null,"REFERENCIA:",null,{"$f":"+'Ficha socio-económica'!B18","v":"COMPLETAR"}]
[{"$f":"'Ficha socio-económica'!G54","v":"ASENTAMIENTO HUMANO O PP.JJ"},{"$f":"IF('Ficha socio-económica'!I54=\"X\",'Ficha socio-económica'!J54,0)","v":0},null,null,"NOMBRES COMPLETOS:",{"$f":"'Ficha socio-económica'!C5","v":"COMPLETAR"},null,null,null,"TELÉFONO FIJO:",null,{"$f":"+'Ficha socio-económica'!C19","v":"COMPLETAR"},{"$f":"+'Ficha socio-económica'!D19","v":"CELULAR:"},{"$f":"+'Ficha socio-económica'!E19","v":"COMPLETAR"}]
[{"$f":"'Ficha socio-económica'!G55","v":"BARRIO POPULAR"},{"$f":"IF('Ficha socio-económica'!I55=\"X\",'Ficha socio-económica'!J55,0)","v":0},null,null,"ESCUELA PROFESIONAL:",{"$f":"'Ficha socio-económica'!C9","v":0},null,null,null,"SI SE AUTOEDUCA ESPECIFIQUE SU ACTIVIDAD:     "]
[{"$f":"'Ficha socio-económica'!G56","v":"CERCADO - PATRIMONIO"},{"$f":"IF('Ficha socio-económica'!I56=\"X\",'Ficha socio-económica'!J56,0)","v":0}]
[{"$f":"'Ficha socio-económica'!G57","v":"CONJUNTO HABITACIONAL O UNIDAD VECINAL"},{"$f":"IF('Ficha socio-económica'!I57=\"X\",'Ficha socio-económica'!J57,0)","v":0},null,null,"PROMEDIO DEL \nSEMESTRE ANTERIOR","PROMEDIO EQUIVANTE","CANTIDAD DE CURSOS DESAPROBADOS",null,null,"TIPO DE SEGURO QUE POSEE:                                                          ",null,{"$f":"+'Ficha socio-económica'!C23","v":"COMPLETAR"}]
[{"$f":"'Ficha socio-económica'!G58","v":"CONDOMINIO"},{"$f":"IF('Ficha socio-económica'!I58=\"X\",'Ficha socio-económica'!J58,0)","v":0},null,null,null,{"$f":"IF(E20>18,20,IF(E20>16,19,IF(E20>14,18,IF(E20=14,17,0))))","v":0},null,null,null,"NOMBRE DE LA ASEGURADORA:",null,{"$f":"+'Ficha socio-económica'!C24","v":"COMPLETAR"}]
[{"$f":"'Ficha socio-económica'!G59","v":"ZONA RESIDENCIAL"},{"$f":"IF('Ficha socio-económica'!I59=\"X\",'Ficha socio-económica'!J59,0)","v":0}]
[{"$f":"'Ficha socio-económica'!G60","v":"ESTERA"},{"$f":"IF('Ficha socio-económica'!I60=\"X\",'Ficha socio-económica'!J60,0)","v":0},null,null,"CATEGORIA","PUNTUACIÓN CALIFICACIÓN","PUNTAJE",null,null,"NOMBRE DEL PADRE DE FAMILIA Y/O TUTOR LEGAL RESPONSABLE ECONÓMICO DE SU EDUCACIÓN:   "]
[{"$f":"'Ficha socio-económica'!G61","v":"PIEDRA CON BARRO"},{"$f":"IF('Ficha socio-económica'!I61=\"X\",'Ficha socio-económica'!J61,0)","v":0},null,null,{"$f":"\"PUNTAJE \"&IF(F13>Tabla!C4,Tabla!D3,IF(F13>Tabla!C5,Tabla!D4,IF(F13>Tabla!C6,Tabla!D5,IF(F13>Tabla!C7,Tabla!D6,IF(F13>Tabla!C8,Tabla!D7,IF(F13>Tabla!C9,Tabla!D8,IF(F13>Tabla!C10,Tabla!D9,IF(F13>Tabla!C11,Tabla!D10,Tabla!D11))))))))","v":"PUNTAJE I"},{"$f":"IF(G23=Tabla!I2,Tabla!H2,IF(G23=Tabla!I3,Tabla!H3,IF(G23=Tabla!I4,Tabla!H4,IF(G23=Tabla!I5,Tabla!H5,IF(G23=Tabla!I6,Tabla!H6,IF(G23=I7,H7,IF(G23=I8,H8,IF(G23=I9,H9,H10))))))))","v":0},{"$f":"IF(F13>=187,20,IF(F13>=137,19,IF(F13>=88,18,IF(F13>=50,17,IF(F13>=24,16,IF(F13>=13,15,IF(F13>=7,14,13)))))))","v":13},null,null,{"$f":"+'Ficha socio-económica'!A27","v":"DNI:"},{"$f":"+'Ficha socio-económica'!B27","v":"COMPLETAR"},{"$f":"+'Ficha socio-económica'!C27","v":"DIRECCIÓN COMPLETA:"},{"$f":"+'Ficha socio-económica'!D27","v":0}]
[{"$f":"'Ficha socio-económica'!G62","v":"MADERA"},{"$f":"IF('Ficha socio-económica'!I62=\"X\",'Ficha socio-económica'!J62,0)","v":0},null,null,null,null,null,null,null,"CENTRO DE TRABAJO:",null,{"$f":"+'Ficha socio-económica'!C28","v":"COMPLETAR"},null,"ACTIVIDAD A LA QUE SE DEDICA:",null,{"$f":"+'Ficha socio-económica'!G28","v":"COMPLETAR"}]
[{"$f":"'Ficha socio-económica'!G63","v":"ADOBE"},{"$f":"IF('Ficha socio-económica'!I63=\"X\",'Ficha socio-económica'!J63,0)","v":0},null,null,null,null,null,null,null,{"$f":"+'Ficha socio-económica'!A29","v":"CELULAR:"},{"$f":"+'Ficha socio-económica'!B29","v":"COMPLETAR"},{"$f":"+'Ficha socio-económica'!C29","v":"TELEFONO:"},{"$f":"+'Ficha socio-económica'!D29","v":"COMPLETAR"}]
[{"$f":"'Ficha socio-económica'!G64","v":"MIXTA"},{"$f":"IF('Ficha socio-económica'!I64=\"X\",'Ficha socio-económica'!J64,0)","v":0}]
[{"$f":"'Ficha socio-económica'!G65","v":"NOBLE (ladrillo, cemento)"},{"$f":"IF('Ficha socio-económica'!I65=\"X\",'Ficha socio-económica'!J65,0)","v":0},null,null,null,null,null,null,null,"NOMBRE DE LA MADRE DE FAMILIA Y/O TUTOR LEGAL RESPONSABLE ECONÓMICO DE SU EDUCACIÓN:   "]
[{"$f":"'Ficha socio-económica'!G66","v":"PLASTICO"},{"$f":"IF('Ficha socio-económica'!I66=\"X\",'Ficha socio-económica'!J66,0)","v":0},null,"VARIABLES","BECA PARCIAL POR INSOLVENCIA ECONOMIA",null,null,null,null,"DNI:",{"$f":"+'Ficha socio-económica'!B32","v":"COMPLETAR"},"DIRECCIÓN COMPLETA:",{"$f":"+'Ficha socio-económica'!D32","v":0}]
[{"$f":"'Ficha socio-económica'!G67","v":"PAJA"},{"$f":"IF('Ficha socio-económica'!I67=\"X\",'Ficha socio-económica'!J67,0)","v":0},null,null,"Responsable Económico de las mensualidades en la UAC del Estudiante: Es el Tutor o Persona Encargada de Solventar los Estudios.",null,4,null,null,"CENTRO DE TRABAJO:",null,{"$f":"+'Ficha socio-económica'!C33","v":"COMPLETAR"},null,"ACTIVIDAD A LA QUE SE DEDICA:",null,{"$f":"+'Ficha socio-económica'!G33","v":"COMPLETAR"}]
[{"$f":"'Ficha socio-económica'!G68","v":"CALAMINA"},{"$f":"IF('Ficha socio-económica'!I68=\"X\",'Ficha socio-económica'!J68,0)","v":0},null,null,"Responsabilidad Económico de las mensualidades en la UAC del Estudiante: Se Auto educa",null,3,null,null,"CELULAR:",{"$f":"+'Ficha socio-económica'!B34","v":"COMPLETAR"},"TELEFONO:",{"$f":"+'Ficha socio-económica'!D34","v":"COMPLETAR"}]
[{"$f":"'Ficha socio-económica'!G69","v":"ETERNIT, TEJA ANDINA"},{"$f":"IF('Ficha socio-económica'!I69=\"X\",'Ficha socio-económica'!J69,0)","v":0},null,null,"Responsable Económico de las mensualidades en la UAC es el Estudiante, Con uno de los padres (madre o padre), o Con ambos padres.",null,3]
[{"$f":"'Ficha socio-económica'!G70","v":"TEJAS"},{"$f":"IF('Ficha socio-económica'!I70=\"X\",'Ficha socio-económica'!J70,0)","v":0},null,null,"Responsable Económico de las mensualidades en la UAC del Estudiante: Es Uno de los padres (padre o madre).",null,2,null,null,"ESPECIFICAR LA ACTIVIDAD LABORAL DEL RESPONSABLE ECONOMICO DE SU EDUCACIÓN: \n",null,null,null,null,{"$f":"+'Ficha socio-económica'!F36","v":"COMPLETAR"}]
[{"$f":"'Ficha socio-económica'!G71","v":"LOZA CON TEJA"},{"$f":"IF('Ficha socio-económica'!I71=\"X\",'Ficha socio-económica'!J71,0)","v":0},null,null,"Responsable Económico de las mensualidades en la UAC del Estudiante: Es Ambos padres",null,1,null,null,{"$f":"+'Ficha socio-económica'!A37","v":"COMPLETAR"}]
[{"$f":"'Ficha socio-económica'!G72","v":"AZOTEA"},{"$f":"IF('Ficha socio-económica'!I72=\"X\",'Ficha socio-económica'!J72,0)","v":0},null,null,"BECA INTEGRAL POR ORFANDAD"]
[{"$f":"'Ficha socio-económica'!G73","v":"TIERRA"},{"$f":"IF('Ficha socio-económica'!I73=\"X\",'Ficha socio-económica'!J73,0)","v":0},null,null,"Responsable Económico de las mensualidades en la UAC del Estudiante: Era el Tutor o persona encargada de solventar los estudios",null,4]
[{"$f":"'Ficha socio-económica'!G74","v":"MADERA"},{"$f":"IF('Ficha socio-económica'!I74=\"X\",'Ficha socio-económica'!J74,0)","v":0},null,null,"Responsable Económico de las mensualidades en la UAC del Estudiante: Era uno de los padres (padre o madre)",null,3]
[{"$f":"'Ficha socio-económica'!G75","v":"FALSO PISO"},{"$f":"IF('Ficha socio-económica'!I75=\"X\",'Ficha socio-económica'!J75,0)","v":0},null,null,"Responsable Económico de las mensualidades en la UAC es el Estudiante, Con uno de los padres (madre o padre), o Con ambos padres.",null,3]
[{"$f":"'Ficha socio-económica'!G76","v":"CEMENTO PULIDO"},{"$f":"IF('Ficha socio-económica'!I76=\"X\",'Ficha socio-económica'!J76,0)","v":0},null,null,"Responsable Económico de las mensualidades en la UAC del Estudiante: Eran ambos padres",null,2]
[{"$f":"'Ficha socio-económica'!G77","v":"VINILICO O LOSETA"},{"$f":"IF('Ficha socio-económica'!I77=\"X\",'Ficha socio-económica'!J77,0)","v":0},null,null,"Estudiante con trabajo esporádico",null,1]
[{"$f":"'Ficha socio-económica'!G78","v":"PARQUET O MADERA"},{"$f":"IF('Ficha socio-económica'!I78=\"X\",'Ficha socio-económica'!J78,0)","v":0},null,null,"ORFANDAD (ACTUALIZACION DE DOCUMENTOS Y DATOS)"]
{"$rows_left_out":202}
{"sheet":"Formato expediente","index":3,"n_rows":2,"n_cols":15,"rows_kept":2,"cut":false,"hidden":true,"merged":[]}
["N°","N° x\n EP","Fecha\nRecepción ","Escuela \nProfesional","Código","Apellidos y Nombres","Sede/Filial","Variables","E.S.E.","Promedio (Nota)","PUNTAJE TOTAL","Matricula 2020-II","Expediente Completo (registro de todo los documentos presentados)","Obsevaciones\n(registro de todos los documentos que le faltan)","NRO. DE CURSOS DESAPROBADOS"]
[null,null,null,{"$f":"UPPER('Ficha socio-económica'!C9)","v":""},{"$f":"UPPER('Ficha socio-económica'!B7)","v":"COMPLETAR"},{"$f":"UPPER('Ficha socio-económica'!K5)","v":"COMPLETAR COMPLETAR, COMPLETAR"},{"$f":"UPPER('Ficha socio-económica'!I9)","v":""},{"$f":"+Cálculo!H49","v":0},{"$f":"+Cálculo!H48","v":13},{"$f":"+Cálculo!H47","v":0},{"$f":"+Cálculo!H50","v":13},null,null,null,{"$f":"+Cálculo!G20","v":0}]

{"sheet":"Tabla","index":4,"n_rows":14,"n_cols":9,"rows_kept":14,"cut":false,"hidden":true,"merged":[]}
[]
[null,"CATEGORIAS",47,null,null,"Entre 235 y 187 puntos (puntaje A y B)","Prioridad","A",20]
[null,"PUNTAJE \"A\"",235,"A",null,"Entre 186 y 137 puntos (puntaje B y C)","Prioridad","B",19]
[null,"PUNTAJE \"B\"",187,"B",null,"Entre 136 y 88 puntos (puntaje C y D)","Prioridad","C",18]
[null,"PUNTAJE \"C\"",137,"C",null,"Entre 87 y 50 puntos (puntaje D y E)","Prioridad","D",17]
[null,"PUNTAJE \"D\"",88,"D",null,"Entre 49 y 24 puntos (puntaje E y F)","Prioridad","E",16]
[null,"PUNTAJE \"E\"",50,"E",null,"Entre 23 y 13 ountos (puntaje F y G)  ","Prioridad","F",15]
[null,"PUNTAJE \"F\"",24,"F",null,"Entre 12 y 7 puntos (puntaje G y H)","Prioridad","G",14]
[null,"PUNTAJE \"G\"",13,"G",null,"Entre 6 y 5 puntos (puntaje H y I)","Prioridad","H",13]
[null,"PUNTAJE \"H\"",7,"H",null,"Entre 4 y 2 puntos (puntaje I y J)","Prioridad","I",12]
[null,"PUNTAJE \"I\"",5,"I",null,"Entre 1 y 0 puntos (puntaje J y K)","Prioridad","J",11]
[null,"PUNTAJE \"J\"",3,"J"]
[null,"PUNTAJE \"k\"",1,"K"]
[null,"SIN PUNTAJE",0,"L"]